species,phenotype_id,name,doi,study,scoring,source,type,growth_conditions,integration_date,number_replicates,to_term,to_name,to_definition,to_comment,to_source_acronym,to_source_name,to_source_url,eo_term,eo_name,eo_definition,eo_comment,eo_source_acronym,eo_source_name,eo_source_url,uo_term,uo_name,uo_definition,uo_comment,uo_source_acronym,uo_source_name,uo_source_url,num_values
Arabidopsis thaliana (NCBI: 3702),87,LN16,10.21958/phenotype:87,"Atwell et. al, Nature 2010","Plants were checked bi-weekly for presence of first buds, and the average leaf number at flowering time of 4 plants of the same accession were collected",,,,2016-06-27T14:14:01.719000Z,0,TO:0000241,leaf number,"""A shoot system morphology trait (TO:0000077) which is the number of leaves (PO:0025034) in a shoot system (PO:0009006) of a plant."" [GR:pj, TO:cooperl]",,PTO,Plant Trait Ontology,https://bioportal.bioontology.org/ontologies/PTO,EO:0007269,growth chamber study,"""The treatment involving study type in which plants were grown in growth chambers."" [GR:pj]",,PECO,Plant Environmental Conditions,https://bioportal.bioontology.org/ontologies/PECO,UO:0000189,count unit,"""A dimensionless unit which denotes a simple count of things."" [MGED:MGED]",,UO,Units of Measurement,https://bioportal.bioontology.org/ontologies/UO,1
Arabidopsis thaliana (NCBI: 3702),652,Branched0,10.21958/phenotype:652,Salt induced changes in Root System Architecture,EZ-Rhizo - length of the Branched Zone at 0 mM NaCl,,0,"1/2 MS medium, 1% agar, pH 5.8 with KOH, plants transferred to media containing 0 mM NaCl 4 days after germination. Root architecture scored 4 days after transfer to treatment media.",2019-05-06T12:47:15.839000Z,0,TO:0000043,root morphology trait,"""A plant axis morphology trait (TO:0000738) which is a quality of a root (PO:0025025)."" [GR:pj, PO:0025025, POC:cooperl]",,PTO,Plant Trait Ontology,https://bioportal.bioontology.org/ontologies/PTO,EO:0001024,vertical agar growth medium,"""An agar growth medium (EO:0001023) involving use of solid growth media in a vertical orientation."" [PO:cooperl]",,PECO,Plant Environmental Conditions,https://bioportal.bioontology.org/ontologies/PECO,UO:0000001,length unit,"""A unit which is a standard measure of the distance between two points."" [Wikipedia:Wikipedia]",,UO,Units of Measurement,https://bioportal.bioontology.org/ontologies/UO,1
Arabidopsis thaliana (NCBI: 3702),273,P31,10.21958/phenotype:273,Ion Concentration,Phosphorus concentrations in leaves,,,,2017-03-21T12:58:51.181000Z,0,TO:0006045,phosphorus concentration,"""A phosphorus content (TO:0001024) which is the concentration of phosphorus (CHEBI:26082) in some plant structure (PO:0009011)"" [GR:Karthik]",,PTO,Plant Trait Ontology,https://bioportal.bioontology.org/ontologies/PTO,EO:0007269,growth chamber study,"""The treatment involving study type in which plants were grown in growth chambers."" [GR:pj]",,PECO,Plant Environmental Conditions,https://bioportal.bioontology.org/ontologies/PECO,UO:0000051,concentration unit,"""A unit which represents a standard measurement of how much of a given substance there is mixed with another substance."" [UOC:GVG]",,UO,Units of Measurement,https://bioportal.bioontology.org/ontologies/UO,6
Arabidopsis thaliana (NCBI: 3702),51,Ca43,10.21958/phenotype:51,"Atwell et. al, Nature 2010","Calcium concentrations in leaves, grown in soil. Elemental analysis was performed with an ICP-MS (PerkinElmer). Sample normalized to calculated weights as described in Baxter et al., 2008",,,,2016-06-27T14:14:01.533000Z,0,TO:0006047,calcium concentration,"""A mineral and ion content related trait (TO:0000465) which is the concentration of calcium (CHEBI:22985) in some plant structure (PO:0009011)."" [GR:Karthik]",,PTO,Plant Trait Ontology,https://bioportal.bioontology.org/ontologies/PTO,EO:0007269,growth chamber study,"""The treatment involving study type in which plants were grown in growth chambers."" [GR:pj]",,PECO,Plant Environmental Conditions,https://bioportal.bioontology.org/ontologies/PECO,UO:0000051,concentration unit,"""A unit which represents a standard measurement of how much of a given substance there is mixed with another substance."" [UOC:GVG]",,UO,Units of Measurement,https://bioportal.bioontology.org/ontologies/UO,1
Arabidopsis thaliana (NCBI: 3702),272,Mg25,10.21958/phenotype:272,Ion Concentration,Magnesium concentrations in leaves,,,,2017-03-21T12:58:51.180000Z,0,TO:0006044,magnesium concentration,"""A mineral and ion content related trait (TO:0000465) which is the concentration of magnesium (CHEBI:25108) in some plant structure (PO:0009011)."" [GR:Karthik]",,PTO,Plant Trait Ontology,https://bioportal.bioontology.org/ontologies/PTO,EO:0007269,growth chamber study,"""The treatment involving study type in which plants were grown in growth chambers."" [GR:pj]",,PECO,Plant Environmental Conditions,https://bioportal.bioontology.org/ontologies/PECO,UO:0000051,concentration unit,"""A unit which represents a standard measurement of how much of a given substance there is mixed with another substance."" [UOC:GVG]",,UO,Units of Measurement,https://bioportal.bioontology.org/ontologies/UO,6
Arabidopsis thaliana (NCBI: 3702),1898,Trichome stem length,10.21958/phenotype:1898,trichome_development_epidermis_metal_traits,Trichome stem length (abbreviated as stem length in the article) measured using the NIS elements software with manual structure identification; from photographs taken in the UV autofluorescence channel; average from at least 25 trichomes from 3 dried leaves of 3 plants.,,0,Arabidopsis seeds were sterilized with chlorine gas; stratified in tubes at 4 deg. C for three days in the dark and sown into standard soil substrate pre-treated with Confidor to prevent black flies infestation. Plants were grown under controlled long-day conditions (16 hr light; 23 oC/8 hr darkness; 18 oC; relative air humidity 60 %). Three seedlings per genotype were planted into individual pots at the first true leaf stage. Three approximately fingernail-sized mature; non-senescent rosette leaves per plant were collected at the age of 5 weeks (at which point plants of some but not all of the genotypes were beginning to bolt).,2023-05-17T13:48:29.004403Z,0,TO:0000911,trichome morphology trait,"""A plant structure morphology trait (TO:0000839) which is a quality of a trichome (PO:0000282)."" [PO:0000282, TO:moorel]",,PTO,Plant Trait Ontology,https://bioportal.bioontology.org/ontologies/PTO,EO:0007269,growth chamber study,"""The treatment involving study type in which plants were grown in growth chambers."" [GR:pj]",,PECO,Plant Environmental Conditions,https://bioportal.bioontology.org/ontologies/PECO,UO:0000017,micrometer,"""A length unit which is equal to one millionth of a meter or 10^[-6] m."" [NIST:NIST]",,UO,Units of Measurement,https://bioportal.bioontology.org/ontologies/UO,1
Arabidopsis thaliana (NCBI: 3702),70,As CFU2,10.21958/phenotype:70,"Atwell et. al, Nature 2010",,,,,2016-06-27T14:14:01.638000Z,0,TO:0000315,bacterial disease resistance,"""The resistance exhibited by a plant or a group of plants (population) in response to the disease caused by a bacterial pathogen infection as compared to the susceptible and/or the reference plants of the same species."" [GR:pj]",It represents the damage done by the diease and/or the pathogen to the plant. The damage is a direct measure of resistance to the particular bacterial strain causing the disease.,PTO,Plant Trait Ontology,https://bioportal.bioontology.org/ontologies/PTO,EO:0007269,growth chamber study,"""The treatment involving study type in which plants were grown in growth chambers."" [GR:pj]",,PECO,Plant Environmental Conditions,https://bioportal.bioontology.org/ontologies/PECO,UO:0000210,colony forming unit,"""A dimensionless count unit which a measure of viable bacterial numbers."" [Wikipedia:Wikipedia]",,UO,Units of Measurement,https://bioportal.bioontology.org/ontologies/UO,1
Arabidopsis thaliana (NCBI: 3702),1899,Trichome autofluorescence,10.21958/phenotype:1899,trichome_development_epidermis_metal_traits,Visually categorized; based on typical appearance; on scale 0 (none); 0;5; 1; 2; 3 (strongest); from photographs of 3 dried leaves of 3 plants; taken in the UV autofluorescence channel.,,1,Arabidopsis seeds were sterilized with chlorine gas; stratified in tubes at 4 deg. C for three days in the dark and sown into standard soil substrate pre-treated with Confidor to prevent black flies infestation. Plants were grown under controlled long-day conditions (16 hr light; 23 oC/8 hr darkness; 18 oC; relative air humidity 60 %). Three seedlings per genotype were planted into individual pots at the first true leaf stage. Three approximately fingernail-sized mature; non-senescent rosette leaves per plant were collected at the age of 5 weeks (at which point plants of some but not all of the genotypes were beginning to bolt).,2023-05-17T13:48:29.004952Z,0,TO:0000911,trichome morphology trait,"""A plant structure morphology trait (TO:0000839) which is a quality of a trichome (PO:0000282)."" [PO:0000282, TO:moorel]",,PTO,Plant Trait Ontology,https://bioportal.bioontology.org/ontologies/PTO,EO:0007269,growth chamber study,"""The treatment involving study type in which plants were grown in growth chambers."" [GR:pj]",,PECO,Plant Environmental Conditions,https://bioportal.bioontology.org/ontologies/PECO,UO:0000186,dimensionless unit,"""A unit which is a standard measure of physical quantity consisting of only a numerical number without any units."" [Wikipedia:Wikipedia]",,UO,Units of Measurement,https://bioportal.bioontology.org/ontologies/UO,1
Arabidopsis thaliana (NCBI: 3702),278,Fe57,10.21958/phenotype:278,Ion Concentration,Iron concentrations in leaves,,,,2017-03-21T12:58:51.187000Z,0,TO:0006049,iron concentration,"""An iron content (TO:0020089) which is the concentration of iron (CHEBI:24873) in some plant structure (PO:0009011)"" [GR:Karthik]",,PTO,Plant Trait Ontology,https://bioportal.bioontology.org/ontologies/PTO,EO:0007269,growth chamber study,"""The treatment involving study type in which plants were grown in growth chambers."" [GR:pj]",,PECO,Plant Environmental Conditions,https://bioportal.bioontology.org/ontologies/PECO,UO:0000051,concentration unit,"""A unit which represents a standard measurement of how much of a given substance there is mixed with another substance."" [UOC:GVG]",,UO,Units of Measurement,https://bioportal.bioontology.org/ontologies/UO,6
Arabidopsis thaliana (NCBI: 3702),670,Apical75,10.21958/phenotype:670,Salt induced changes in Root System Architecture,EZ-Rhizo - length of the Apical Zone at 75 mM NaCl,,0,"1/2 MS medium, 1% agar, pH 5.8 with KOH, plants transferred to media containing 75 mM NaCl 4 days after germination. Root architecture scored 8 days after transfer to treatment media.",2019-05-06T12:47:15.846000Z,0,TO:0000043,root morphology trait,"""A plant axis morphology trait (TO:0000738) which is a quality of a root (PO:0025025)."" [GR:pj, PO:0025025, POC:cooperl]",,PTO,Plant Trait Ontology,https://bioportal.bioontology.org/ontologies/PTO,EO:0001024,vertical agar growth medium,"""An agar growth medium (EO:0001023) involving use of solid growth media in a vertical orientation."" [PO:cooperl]",,PECO,Plant Environmental Conditions,https://bioportal.bioontology.org/ontologies/PECO,UO:0000001,length unit,"""A unit which is a standard measure of the distance between two points."" [Wikipedia:Wikipedia]",,UO,Units of Measurement,https://bioportal.bioontology.org/ontologies/UO,1
Arabidopsis thaliana (NCBI: 3702),663,MRVA75,10.21958/phenotype:663,Salt induced changes in Root System Architecture,EZ-Rhizo - Main Root Vector Angle at 75 mM NaCl,,0,"1/2 MS medium, 1% agar, pH 5.8 with KOH, plants transferred to media containing 75 mM NaCl 4 days after germination. Root architecture scored 8 days after transfer to treatment media.",2019-05-06T12:47:15.843000Z,0,TO:0000043,root morphology trait,"""A plant axis morphology trait (TO:0000738) which is a quality of a root (PO:0025025)."" [GR:pj, PO:0025025, POC:cooperl]",,PTO,Plant Trait Ontology,https://bioportal.bioontology.org/ontologies/PTO,EO:0001024,vertical agar growth medium,"""An agar growth medium (EO:0001023) involving use of solid growth media in a vertical orientation."" [PO:cooperl]",,PECO,Plant Environmental Conditions,https://bioportal.bioontology.org/ontologies/PECO,UO:0000185,degree,"""A plane angle unit which is equal to 1/360 of a full rotation or 1.7453310^[-2] rad."" [Wikipedia:Wikipedia]",,UO,Units of Measurement,https://bioportal.bioontology.org/ontologies/UO,1
Arabidopsis thaliana (NCBI: 3702),1905,Metal gradient in trichomes,10.21958/phenotype:1905,trichome_development_epidermis_metal_traits,Visually categorized; based on typical appearance; scale reflects gradient length - 0 (no intensity gradient at the trichome stem; 0.5; 1; 1.5; 2; 2.5; 3 (longest); from bright field  photographs of 3 dithizone-staines leaves of 3 plants. Abbreviated as metal gradient in the article.,,1,Arabidopsis seeds were sterilized with chlorine gas; stratified in tubes at 4 deg. C for three days in the dark and sown into standard soil substrate pre-treated with Confidor to prevent black flies infestation. Plants were grown under controlled long-day conditions (16 hr light; 23 oC/8 hr darkness; 18 oC; relative air humidity 60 %). Three seedlings per genotype were planted into individual pots at the first true leaf stage. Three approximately fingernail-sized mature; non-senescent rosette leaves per plant were collected at the age of 5 weeks (at which point plants of some but not all of the genotypes were beginning to bolt).,2023-05-17T13:48:29.008366Z,0,TO:0000465,mineral and ion content related trait,"""A biochemical trait (TO:0000277) that is the amount of a particular mineral or ion constituent occurring in a plant anatomical entity (PO:0025131)."" [GR:pj]",May be measured in a dry mass or in a fresh tissue.,PTO,Plant Trait Ontology,https://bioportal.bioontology.org/ontologies/PTO,EO:0007269,growth chamber study,"""The treatment involving study type in which plants were grown in growth chambers."" [GR:pj]",,PECO,Plant Environmental Conditions,https://bioportal.bioontology.org/ontologies/PECO,UO:0000186,dimensionless unit,"""A unit which is a standard measure of physical quantity consisting of only a numerical number without any units."" [Wikipedia:Wikipedia]",,UO,Units of Measurement,https://bioportal.bioontology.org/ontologies/UO,1
Arabidopsis thaliana (NCBI: 3702),271,Na23,10.21958/phenotype:271,Ion Concentration,odium concentrations in leaves,,,,2017-03-21T12:58:51.179000Z,0,TO:0000526,sodium concentration,"""The total sodium ion concentration measured in a given volume of a plant or a plant part or plant extract."" [GR:pj]",,PTO,Plant Trait Ontology,https://bioportal.bioontology.org/ontologies/PTO,EO:0007269,growth chamber study,"""The treatment involving study type in which plants were grown in growth chambers."" [GR:pj]",,PECO,Plant Environmental Conditions,https://bioportal.bioontology.org/ontologies/PECO,UO:0000051,concentration unit,"""A unit which represents a standard measurement of how much of a given substance there is mixed with another substance."" [UOC:GVG]",,UO,Units of Measurement,https://bioportal.bioontology.org/ontologies/UO,6
Arabidopsis thaliana (NCBI: 3702),22,Co59,10.21958/phenotype:22,"Atwell et. al, Nature 2010","Cobalt concentrations in leaves, grown in soil. Elemental analysis was performed with an ICP-MS (PerkinElmer). Sample normalized to calculated weights as described in Baxter et al., 2008",,,,2016-06-27T14:14:01.077000Z,0,TO:0006050,cobalt concentration,"""A mineral and ion content related trait (TO:0000465) which is the concentration of cobalt (CHEBI:33888) in some plant structure (PO:0009011)."" [GR:Karthik]",,PTO,Plant Trait Ontology,https://bioportal.bioontology.org/ontologies/PTO,EO:0007269,growth chamber study,"""The treatment involving study type in which plants were grown in growth chambers."" [GR:pj]",,PECO,Plant Environmental Conditions,https://bioportal.bioontology.org/ontologies/PECO,UO:0000051,concentration unit,"""A unit which represents a standard measurement of how much of a given substance there is mixed with another substance."" [UOC:GVG]",,UO,Units of Measurement,https://bioportal.bioontology.org/ontologies/UO,1
Arabidopsis thaliana (NCBI: 3702),1894,Trichome solidity,10.21958/phenotype:1894,trichome_development_epidermis_metal_traits,Trichome solidity (abbreviated as solidity in the article) determined using built-in functions of Fiji ;from binary images generated by thresholding polarized light photos using the Yen method as implemented in Fiji software; average from at least 25 interactively selected detached or in situ trichomes from 3 leaves of 3 plants.,,1,Arabidopsis seeds were sterilized with chlorine gas; stratified in tubes at 4 deg. C for three days in the dark and sown into standard soil substrate pre-treated with Confidor to prevent black flies infestation. Plants were grown under controlled long-day conditions (16 hr light; 23 oC/8 hr darkness; 18 oC; relative air humidity 60 %). Three seedlings per genotype were planted into individual pots at the first true leaf stage. Three approximately fingernail-sized mature; non-senescent rosette leaves per plant were collected at the age of 5 weeks (at which point plants of some but not all of the genotypes were beginning to bolt).,2023-05-17T13:48:29.002084Z,0,TO:0000911,trichome morphology trait,"""A plant structure morphology trait (TO:0000839) which is a quality of a trichome (PO:0000282)."" [PO:0000282, TO:moorel]",,PTO,Plant Trait Ontology,https://bioportal.bioontology.org/ontologies/PTO,EO:0007269,growth chamber study,"""The treatment involving study type in which plants were grown in growth chambers."" [GR:pj]",,PECO,Plant Environmental Conditions,https://bioportal.bioontology.org/ontologies/PECO,UO:0000186,dimensionless unit,"""A unit which is a standard measure of physical quantity consisting of only a numerical number without any units."" [Wikipedia:Wikipedia]",,UO,Units of Measurement,https://bioportal.bioontology.org/ontologies/UO,1
Arabidopsis thaliana (NCBI: 3702),641,MRVL0,10.21958/phenotype:641,Salt induced changes in Root System Architecture,EZ-Rhizo - Main Root Vector Length (straight line from beginning to end of the main root) at 0 mM NaCl,,0,"1/2 MS medium, 1% agar, pH 5.8 with KOH, plants transferred to media containing 0 mM NaCl 4 days after germination. Root architecture scored 4 days after transfer to treatment media.",2019-05-06T12:47:15.834000Z,0,TO:0000043,root morphology trait,"""A plant axis morphology trait (TO:0000738) which is a quality of a root (PO:0025025)."" [GR:pj, PO:0025025, POC:cooperl]",,PTO,Plant Trait Ontology,https://bioportal.bioontology.org/ontologies/PTO,EO:0001024,vertical agar growth medium,"""An agar growth medium (EO:0001023) involving use of solid growth media in a vertical orientation."" [PO:cooperl]",,PECO,Plant Environmental Conditions,https://bioportal.bioontology.org/ontologies/PECO,UO:0000001,length unit,"""A unit which is a standard measure of the distance between two points."" [Wikipedia:Wikipedia]",,UO,Units of Measurement,https://bioportal.bioontology.org/ontologies/UO,1
Arabidopsis thaliana (NCBI: 3702),282,Zn66,10.21958/phenotype:282,Ion Concentration,Zinc concentrations in leaves,,,,2017-03-21T12:58:51.191000Z,0,TO:0006053,zinc concentration,"""A zinc content (TO:0020090) which is the concentration of zinc (CHEBI:27364) in some plant structure (PO:0009011)"" [GR:Karthik]",,PTO,Plant Trait Ontology,https://bioportal.bioontology.org/ontologies/PTO,EO:0007269,growth chamber study,"""The treatment involving study type in which plants were grown in growth chambers."" [GR:pj]",,PECO,Plant Environmental Conditions,https://bioportal.bioontology.org/ontologies/PECO,UO:0000051,concentration unit,"""A unit which represents a standard measurement of how much of a given substance there is mixed with another substance."" [UOC:GVG]",,UO,Units of Measurement,https://bioportal.bioontology.org/ontologies/UO,6
Arabidopsis thaliana (NCBI: 3702),269,Li7,10.21958/phenotype:269,Ion Concentration,Lithium concentrations in leaves,,,,2017-03-21T12:58:51.176000Z,0,TO:0006042,lithium concentration,"""A mineral and ion content related trait (TO:0000465) which is the concentration of lithium (CHEBI:33298) in some plant structure (PO:0009011)."" [GR:Karthik]",May be assayed for per gram fresh weight.,PTO,Plant Trait Ontology,https://bioportal.bioontology.org/ontologies/PTO,EO:0007269,growth chamber study,"""The treatment involving study type in which plants were grown in growth chambers."" [GR:pj]",,PECO,Plant Environmental Conditions,https://bioportal.bioontology.org/ontologies/PECO,UO:0000051,concentration unit,"""A unit which represents a standard measurement of how much of a given substance there is mixed with another substance."" [UOC:GVG]",,UO,Units of Measurement,https://bioportal.bioontology.org/ontologies/UO,6
Arabidopsis thaliana (NCBI: 3702),261,FT10,10.21958/phenotype:261,1001genomes flowering time phenotypes,"Flowering time was scored as days until first
open flower",,,"Seeds for all 1135 accessions were surface-sterilized with chlorine gas. Seeds were distributed in pots with four replicates in a randomized block design, each replicate corresponding to one block. Plants were grown in growth chambers with the following settings: after 6 days of stratification in the dark at 4ºC, constant temperature of 10°C with 16 hours light / 8 hours darkness, 65% humidity. All trays within a block were moved to a new shelf and rotated 180º every other day to minimize position effects.",2016-08-14T14:08:50.666000Z,0,TO:0000344,days to flowering trait,"""A flowering time trait (TO:0002616)which is the number of days required for an individual flower (PO:0009046), a whole plant (PO:0000003) or a plant population to reach flowering stage (PO:0007616) from a predetermined time point (e.g. the date of seed sowing, seedling transplant, or seedling emergence)."" [GR:pj, TO:cooperl]","Often determinded by either pollen shedding, exsertion of the anthers or simply opening of the flower.",PTO,Plant Trait Ontology,https://bioportal.bioontology.org/ontologies/PTO,EO:0007269,growth chamber study,"""The treatment involving study type in which plants were grown in growth chambers."" [GR:pj]",,PECO,Plant Environmental Conditions,https://bioportal.bioontology.org/ontologies/PECO,UO:0000033,day,"""A time unit which is equal to 24 hours."" [Wikipedia:Wikipedia]",,UO,Units of Measurement,https://bioportal.bioontology.org/ontologies/UO,1
Arabidopsis thaliana (NCBI: 3702),42,Bs CFU2,10.21958/phenotype:42,"Atwell et. al, Nature 2010",In planta bacterial growth (number of CFU / leaf area) of the P. viridiflava strain was individually measured as described in Goss and Bergelson 2006,,,,2016-06-27T14:14:01.491000Z,0,TO:0000315,bacterial disease resistance,"""The resistance exhibited by a plant or a group of plants (population) in response to the disease caused by a bacterial pathogen infection as compared to the susceptible and/or the reference plants of the same species."" [GR:pj]",It represents the damage done by the diease and/or the pathogen to the plant. The damage is a direct measure of resistance to the particular bacterial strain causing the disease.,PTO,Plant Trait Ontology,https://bioportal.bioontology.org/ontologies/PTO,EO:0007269,growth chamber study,"""The treatment involving study type in which plants were grown in growth chambers."" [GR:pj]",,PECO,Plant Environmental Conditions,https://bioportal.bioontology.org/ontologies/PECO,UO:0000210,colony forming unit,"""A dimensionless count unit which a measure of viable bacterial numbers."" [Wikipedia:Wikipedia]",,UO,Units of Measurement,https://bioportal.bioontology.org/ontologies/UO,1