species,phenotype_id,name,doi,study,scoring,source,type,growth_conditions,integration_date,number_replicates,to_term,to_name,to_definition,to_comment,to_source_acronym,to_source_name,to_source_url,eo_term,eo_name,eo_definition,eo_comment,eo_source_acronym,eo_source_name,eo_source_url,uo_term,uo_name,uo_definition,uo_comment,uo_source_acronym,uo_source_name,uo_source_url,num_values
Arabidopsis thaliana (NCBI: 3702),617,clim-tmax10,10.21958/phenotype:617,Lifetime fitness in Germany and Spain under rainfall manipulation,Maximum Temperature of October (_C),,0,,2019-03-12T19:08:54.465000Z,0,TO:0000183,other miscellaneous trait,"""The trait instances, which either cannot be assigned any of the eight top level parent terms such as biochemical, anatomy, development quality, stature/vigor, sterility/fertility, stress and the yield or are yet to be assigned a parent."" [GR:pj]",,PTO,Plant Trait Ontology,https://bioportal.bioontology.org/ontologies/PTO,EO:0007064,ecological environment,"""A plant treatment (EO:0001001) involving exposure to the various factors that comprise a geographical/regional location."" [GR:pj, PO:cooperl]",,PECO,Plant Environmental Conditions,https://bioportal.bioontology.org/ontologies/PECO,UO:0000005,temperature unit,"""A unit which is a standard measure of the average kinetic energy of the particles in a sample of matter."" [Wikipedia:Wikipedia]",,UO,Units of Measurement,https://bioportal.bioontology.org/ontologies/UO,1
Arabidopsis thaliana (NCBI: 3702),87,LN16,10.21958/phenotype:87,"Atwell et. al, Nature 2010","Plants were checked bi-weekly for presence of first buds, and the average leaf number at flowering time of 4 plants of the same accession were collected",,,,2016-06-27T14:14:01.719000Z,0,TO:0000241,leaf number,"""A shoot system morphology trait (TO:0000077) which is the number of leaves (PO:0025034) in a shoot system (PO:0009006) of a plant."" [GR:pj, TO:cooperl]",,PTO,Plant Trait Ontology,https://bioportal.bioontology.org/ontologies/PTO,EO:0007269,growth chamber study,"""The treatment involving study type in which plants were grown in growth chambers."" [GR:pj]",,PECO,Plant Environmental Conditions,https://bioportal.bioontology.org/ontologies/PECO,UO:0000189,count unit,"""A dimensionless unit which denotes a simple count of things."" [MGED:MGED]",,UO,Units of Measurement,https://bioportal.bioontology.org/ontologies/UO,1
Arabidopsis thaliana (NCBI: 3702),550,clim-aet6,10.21958/phenotype:550,Lifetime fitness in Germany and Spain under rainfall manipulation,Actual evapotranspiration of June (mm),,0,,2019-03-12T19:08:54.433000Z,0,TO:0000183,other miscellaneous trait,"""The trait instances, which either cannot be assigned any of the eight top level parent terms such as biochemical, anatomy, development quality, stature/vigor, sterility/fertility, stress and the yield or are yet to be assigned a parent."" [GR:pj]",,PTO,Plant Trait Ontology,https://bioportal.bioontology.org/ontologies/PTO,EO:0007064,ecological environment,"""A plant treatment (EO:0001001) involving exposure to the various factors that comprise a geographical/regional location."" [GR:pj, PO:cooperl]",,PECO,Plant Environmental Conditions,https://bioportal.bioontology.org/ontologies/PECO,UO:0000270,volumetric flow rate unit,"""A unit which is a standard measure of the volume of fluid which passes through a given surface per unit time ."" [Wikipedia:Wikipedia]",,UO,Units of Measurement,https://bioportal.bioontology.org/ontologies/UO,1
Arabidopsis thaliana (NCBI: 3702),1898,Trichome stem length,10.21958/phenotype:1898,trichome_development_epidermis_metal_traits,Trichome stem length (abbreviated as stem length in the article) measured using the NIS elements software with manual structure identification; from photographs taken in the UV autofluorescence channel; average from at least 25 trichomes from 3 dried leaves of 3 plants.,,0,Arabidopsis seeds were sterilized with chlorine gas; stratified in tubes at 4 deg. C for three days in the dark and sown into standard soil substrate pre-treated with Confidor to prevent black flies infestation. Plants were grown under controlled long-day conditions (16 hr light; 23 oC/8 hr darkness; 18 oC; relative air humidity 60 %). Three seedlings per genotype were planted into individual pots at the first true leaf stage. Three approximately fingernail-sized mature; non-senescent rosette leaves per plant were collected at the age of 5 weeks (at which point plants of some but not all of the genotypes were beginning to bolt).,2023-05-17T13:48:29.004403Z,0,TO:0000911,trichome morphology trait,"""A plant structure morphology trait (TO:0000839) which is a quality of a trichome (PO:0000282)."" [PO:0000282, TO:moorel]",,PTO,Plant Trait Ontology,https://bioportal.bioontology.org/ontologies/PTO,EO:0007269,growth chamber study,"""The treatment involving study type in which plants were grown in growth chambers."" [GR:pj]",,PECO,Plant Environmental Conditions,https://bioportal.bioontology.org/ontologies/PECO,UO:0000017,micrometer,"""A length unit which is equal to one millionth of a meter or 10^[-6] m."" [NIST:NIST]",,UO,Units of Measurement,https://bioportal.bioontology.org/ontologies/UO,1
Arabidopsis thaliana (NCBI: 3702),552,clim-aet8,10.21958/phenotype:552,Lifetime fitness in Germany and Spain under rainfall manipulation,Actual evapotranspiration of August (mm),,0,,2019-03-12T19:08:54.434000Z,0,TO:0000183,other miscellaneous trait,"""The trait instances, which either cannot be assigned any of the eight top level parent terms such as biochemical, anatomy, development quality, stature/vigor, sterility/fertility, stress and the yield or are yet to be assigned a parent."" [GR:pj]",,PTO,Plant Trait Ontology,https://bioportal.bioontology.org/ontologies/PTO,EO:0007064,ecological environment,"""A plant treatment (EO:0001001) involving exposure to the various factors that comprise a geographical/regional location."" [GR:pj, PO:cooperl]",,PECO,Plant Environmental Conditions,https://bioportal.bioontology.org/ontologies/PECO,UO:0000270,volumetric flow rate unit,"""A unit which is a standard measure of the volume of fluid which passes through a given surface per unit time ."" [Wikipedia:Wikipedia]",,UO,Units of Measurement,https://bioportal.bioontology.org/ontologies/UO,1
Arabidopsis thaliana (NCBI: 3702),70,As CFU2,10.21958/phenotype:70,"Atwell et. al, Nature 2010",,,,,2016-06-27T14:14:01.638000Z,0,TO:0000315,bacterial disease resistance,"""The resistance exhibited by a plant or a group of plants (population) in response to the disease caused by a bacterial pathogen infection as compared to the susceptible and/or the reference plants of the same species."" [GR:pj]",It represents the damage done by the diease and/or the pathogen to the plant. The damage is a direct measure of resistance to the particular bacterial strain causing the disease.,PTO,Plant Trait Ontology,https://bioportal.bioontology.org/ontologies/PTO,EO:0007269,growth chamber study,"""The treatment involving study type in which plants were grown in growth chambers."" [GR:pj]",,PECO,Plant Environmental Conditions,https://bioportal.bioontology.org/ontologies/PECO,UO:0000210,colony forming unit,"""A dimensionless count unit which a measure of viable bacterial numbers."" [Wikipedia:Wikipedia]",,UO,Units of Measurement,https://bioportal.bioontology.org/ontologies/UO,1
Arabidopsis thaliana (NCBI: 3702),539,rSeeds thp,10.21958/phenotype:539,Lifetime fitness in Germany and Spain under rainfall manipulation,"relative seed production (# offspring, excluding plants that died) in Tuebingen high precipitation treatment and population (high density) replicate",,0,,2019-03-12T19:08:54.428000Z,0,TO:0000371,yield trait,"""A plant trait (TO:0000387) which is a harvestable product that is a plant anatomical entity (PO:0025131) or one or more constituent cellular components (GO:0005575) contained therein."" [GR:pj, TO:cooperl]",,PTO,Plant Trait Ontology,https://bioportal.bioontology.org/ontologies/PTO,EO:0007256,field study,"""The treatment where the plants were grown under field conditions. This may involve supplemental treatments in addition to any naturally occurring conditions."" [GR:pj]",,PECO,Plant Environmental Conditions,https://bioportal.bioontology.org/ontologies/PECO,UO:0000190,ratio,"""A dimensionless unit which denotes an amount or magnitude of one quantity relative to another."" [Wikipedia:Wikipedia]",,UO,Units of Measurement,https://bioportal.bioontology.org/ontologies/UO,1
Arabidopsis thaliana (NCBI: 3702),554,clim-bio1,10.21958/phenotype:554,Lifetime fitness in Germany and Spain under rainfall manipulation,,,,,2019-03-12T19:08:54.434000Z,0,,,,,,,,,,,,,,,,,,,,,,1
Arabidopsis thaliana (NCBI: 3702),386,Mean(TRL) CK,10.21958/phenotype:386,Cytokinin (CK) treatment,"After 3 days of treatment, plates were scanned with CCD flatbed scanners (EPSON Perfection V600 Photo, Seiko Epson, Nagano, Japan), and images used to quantify root parameters with FIJI, by using the tool ‘segmented line’ (Schindelin et al., 2012) as described in Ristova and Busch (2017). In particular, we quantified: primary root length on day 10 (P), growth rate of P after treatment (P2), branching zone or the length of P between the first and last visible lateral root (R), average lateral root length (LRL), and visible lateral root number (LR.No).",,,"Seeds were surface sterilized in a desiccator using 100 ml of household bleach and 3.5 ml of 37% HCl for 1 h. The seeds were stratified in water at 4°C in the dark for 3 days, and were sown on square Petri dishes containing 57 ml of growth medium. The control growth medium (before transfer) consisted of one‐fifth‐strength MS medium with MES buffer (Ducheva Biochemie, Haarlem, The Netherlands), 1% sucrose, 0.8% agar (Ducheva Biochemie), and adjusted to pH 5.7.",2018-09-03T13:06:10.133000Z,0,TO:0001012,lateral root length,"""A root length (TO:0000227) that is the length of one or more lateral roots (PO:0020121)."" [GR:pj, TO:austin_meier, TO:seymour_megan]",Refer to length (PATO:0000122): A 1-D extent quality which is equal to the distance between two points.,PTO,Plant Trait Ontology,https://bioportal.bioontology.org/ontologies/PTO,EO:0007066,cytokinin treatment,"""A growth hormone treatment (EO:0007165) involving the use of cytokinin (or its homolog) growth hormone to study various types of responses on its extrinsic and/or intrinsic application."" [GR:pj]",,PECO,Plant Environmental Conditions,https://bioportal.bioontology.org/ontologies/PECO,UO:0000016,millimeter,"""A length unit which is equal to one thousandth of a meter or 10^[-3] m."" [NIST:NIST]",,UO,Units of Measurement,https://bioportal.bioontology.org/ontologies/UO,1
Arabidopsis thaliana (NCBI: 3702),1899,Trichome autofluorescence,10.21958/phenotype:1899,trichome_development_epidermis_metal_traits,Visually categorized; based on typical appearance; on scale 0 (none); 0;5; 1; 2; 3 (strongest); from photographs of 3 dried leaves of 3 plants; taken in the UV autofluorescence channel.,,1,Arabidopsis seeds were sterilized with chlorine gas; stratified in tubes at 4 deg. C for three days in the dark and sown into standard soil substrate pre-treated with Confidor to prevent black flies infestation. Plants were grown under controlled long-day conditions (16 hr light; 23 oC/8 hr darkness; 18 oC; relative air humidity 60 %). Three seedlings per genotype were planted into individual pots at the first true leaf stage. Three approximately fingernail-sized mature; non-senescent rosette leaves per plant were collected at the age of 5 weeks (at which point plants of some but not all of the genotypes were beginning to bolt).,2023-05-17T13:48:29.004952Z,0,TO:0000911,trichome morphology trait,"""A plant structure morphology trait (TO:0000839) which is a quality of a trichome (PO:0000282)."" [PO:0000282, TO:moorel]",,PTO,Plant Trait Ontology,https://bioportal.bioontology.org/ontologies/PTO,EO:0007269,growth chamber study,"""The treatment involving study type in which plants were grown in growth chambers."" [GR:pj]",,PECO,Plant Environmental Conditions,https://bioportal.bioontology.org/ontologies/PECO,UO:0000186,dimensionless unit,"""A unit which is a standard measure of physical quantity consisting of only a numerical number without any units."" [Wikipedia:Wikipedia]",,UO,Units of Measurement,https://bioportal.bioontology.org/ontologies/UO,1
Arabidopsis thaliana (NCBI: 3702),364,Mean(P2) IAA,10.21958/phenotype:364,Auxin (IAA) treatment,"After 3 days of treatment, plates were scanned with CCD flatbed scanners (EPSON Perfection V600 Photo, Seiko Epson, Nagano, Japan), and images used to quantify root parameters with FIJI, by using the tool ‘segmented line’ (Schindelin et al., 2012) as described in Ristova and Busch (2017). In particular, we quantified: primary root length on day 10 (P), growth rate of P after treatment (P2), branching zone or the length of P between the first and last visible lateral root (R), average lateral root length (LRL), and visible lateral root number (LR.No).",,,"Seeds were surface sterilized in a desiccator using 100 ml of household bleach and 3.5 ml of 37% HCl for 1 h. The seeds were stratified in water at 4°C in the dark for 3 days, and were sown on square Petri dishes containing 57 ml of growth medium. The control growth medium (before transfer) consisted of one‐fifth‐strength MS medium with MES buffer (Ducheva Biochemie, Haarlem, The Netherlands), 1% sucrose, 0.8% agar (Ducheva Biochemie), and adjusted to pH 5.7.",2018-09-03T13:04:12.731000Z,0,TO:0000227,root length,"""A root morphology trait (TO:0000043) which is the length of one or more roots (PO:0009005)."" [GR:jcl\nGR\:pj, TO:austin_meier\nTO\:cooperl]",refer to PATO:0000122- A 1-D extent quality which is equal to the distance between two points.,PTO,Plant Trait Ontology,https://bioportal.bioontology.org/ontologies/PTO,EO:0007074,auxin treatment,"""A growth hormone treatment (EO:0007165) involving the use of auxin (or its homolog) growth hormone to study various types of responses on its extrinsic and/or intrinsic application."" [GR:pj]",,PECO,Plant Environmental Conditions,https://bioportal.bioontology.org/ontologies/PECO,UO:0000016,millimeter,"""A length unit which is equal to one thousandth of a meter or 10^[-3] m."" [NIST:NIST]",,UO,Units of Measurement,https://bioportal.bioontology.org/ontologies/UO,1
Arabidopsis thaliana (NCBI: 3702),576,clim-gs1,10.21958/phenotype:576,Lifetime fitness in Germany and Spain under rainfall manipulation,Growing season includes January (yes/no),,0,,2019-03-12T19:08:54.445000Z,0,TO:0000183,other miscellaneous trait,"""The trait instances, which either cannot be assigned any of the eight top level parent terms such as biochemical, anatomy, development quality, stature/vigor, sterility/fertility, stress and the yield or are yet to be assigned a parent."" [GR:pj]",,PTO,Plant Trait Ontology,https://bioportal.bioontology.org/ontologies/PTO,EO:0007064,ecological environment,"""A plant treatment (EO:0001001) involving exposure to the various factors that comprise a geographical/regional location."" [GR:pj, PO:cooperl]",,PECO,Plant Environmental Conditions,https://bioportal.bioontology.org/ontologies/PECO,UO:0000186,dimensionless unit,"""A unit which is a standard measure of physical quantity consisting of only a numerical number without any units."" [Wikipedia:Wikipedia]",,UO,Units of Measurement,https://bioportal.bioontology.org/ontologies/UO,1
Arabidopsis thaliana (NCBI: 3702),605,clim-prec10,10.21958/phenotype:605,Lifetime fitness in Germany and Spain under rainfall manipulation,Precipitation of October (mm),,0,,2019-03-12T19:08:54.458000Z,0,TO:0000183,other miscellaneous trait,"""The trait instances, which either cannot be assigned any of the eight top level parent terms such as biochemical, anatomy, development quality, stature/vigor, sterility/fertility, stress and the yield or are yet to be assigned a parent."" [GR:pj]",,PTO,Plant Trait Ontology,https://bioportal.bioontology.org/ontologies/PTO,EO:0007064,ecological environment,"""A plant treatment (EO:0001001) involving exposure to the various factors that comprise a geographical/regional location."" [GR:pj, PO:cooperl]",,PECO,Plant Environmental Conditions,https://bioportal.bioontology.org/ontologies/PECO,UO:0000270,volumetric flow rate unit,"""A unit which is a standard measure of the volume of fluid which passes through a given surface per unit time ."" [Wikipedia:Wikipedia]",,UO,Units of Measurement,https://bioportal.bioontology.org/ontologies/UO,1
Arabidopsis thaliana (NCBI: 3702),92,Leaf serr 22,10.21958/phenotype:92,"Atwell et. al, Nature 2010",Average severity of serration across 4 plants was scored between 0 (entire lamina) and 1.5 (jagged serration) after 5 weeks of growth,,,,2016-06-27T14:14:01.743000Z,0,TO:0006063,leaf margin serrated,"""A leaf margin morphology trait (TO:0002635) which is a notched or grooved leaf margin (PO:0020128)."" [GR:curators, PO:0020128, POC:cooperl]",Refer to serrated (PATO:0001206): A shape quality inhering in a bearer by virtue of having sharp straight-edged teeth pointing to the apex.,PTO,Plant Trait Ontology,https://bioportal.bioontology.org/ontologies/PTO,EO:0007269,growth chamber study,"""The treatment involving study type in which plants were grown in growth chambers."" [GR:pj]",,PECO,Plant Environmental Conditions,https://bioportal.bioontology.org/ontologies/PECO,UO:0000186,dimensionless unit,"""A unit which is a standard measure of physical quantity consisting of only a numerical number without any units."" [Wikipedia:Wikipedia]",,UO,Units of Measurement,https://bioportal.bioontology.org/ontologies/UO,1
Arabidopsis thaliana (NCBI: 3702),541,rSeeds tlp,10.21958/phenotype:541,Lifetime fitness in Germany and Spain under rainfall manipulation,"relative seed production (# offspring, excluding plants that died) in Tuebingen low precipitation treatment and population (high density) replicate",,0,,2019-03-12T19:08:54.429000Z,0,TO:0000371,yield trait,"""A plant trait (TO:0000387) which is a harvestable product that is a plant anatomical entity (PO:0025131) or one or more constituent cellular components (GO:0005575) contained therein."" [GR:pj, TO:cooperl]",,PTO,Plant Trait Ontology,https://bioportal.bioontology.org/ontologies/PTO,EO:0007256,field study,"""The treatment where the plants were grown under field conditions. This may involve supplemental treatments in addition to any naturally occurring conditions."" [GR:pj]",,PECO,Plant Environmental Conditions,https://bioportal.bioontology.org/ontologies/PECO,UO:0000190,ratio,"""A dimensionless unit which denotes an amount or magnitude of one quantity relative to another."" [Wikipedia:Wikipedia]",,UO,Units of Measurement,https://bioportal.bioontology.org/ontologies/UO,1
Arabidopsis thaliana (NCBI: 3702),1905,Metal gradient in trichomes,10.21958/phenotype:1905,trichome_development_epidermis_metal_traits,Visually categorized; based on typical appearance; scale reflects gradient length - 0 (no intensity gradient at the trichome stem; 0.5; 1; 1.5; 2; 2.5; 3 (longest); from bright field  photographs of 3 dithizone-staines leaves of 3 plants. Abbreviated as metal gradient in the article.,,1,Arabidopsis seeds were sterilized with chlorine gas; stratified in tubes at 4 deg. C for three days in the dark and sown into standard soil substrate pre-treated with Confidor to prevent black flies infestation. Plants were grown under controlled long-day conditions (16 hr light; 23 oC/8 hr darkness; 18 oC; relative air humidity 60 %). Three seedlings per genotype were planted into individual pots at the first true leaf stage. Three approximately fingernail-sized mature; non-senescent rosette leaves per plant were collected at the age of 5 weeks (at which point plants of some but not all of the genotypes were beginning to bolt).,2023-05-17T13:48:29.008366Z,0,TO:0000465,mineral and ion content related trait,"""A biochemical trait (TO:0000277) that is the amount of a particular mineral or ion constituent occurring in a plant anatomical entity (PO:0025131)."" [GR:pj]",May be measured in a dry mass or in a fresh tissue.,PTO,Plant Trait Ontology,https://bioportal.bioontology.org/ontologies/PTO,EO:0007269,growth chamber study,"""The treatment involving study type in which plants were grown in growth chambers."" [GR:pj]",,PECO,Plant Environmental Conditions,https://bioportal.bioontology.org/ontologies/PECO,UO:0000186,dimensionless unit,"""A unit which is a standard measure of physical quantity consisting of only a numerical number without any units."" [Wikipedia:Wikipedia]",,UO,Units of Measurement,https://bioportal.bioontology.org/ontologies/UO,1
Arabidopsis thaliana (NCBI: 3702),626,clim-tmax8,10.21958/phenotype:626,Lifetime fitness in Germany and Spain under rainfall manipulation,Maximum Temperature of August (_C),,0,,2019-03-12T19:08:54.469000Z,0,TO:0000183,other miscellaneous trait,"""The trait instances, which either cannot be assigned any of the eight top level parent terms such as biochemical, anatomy, development quality, stature/vigor, sterility/fertility, stress and the yield or are yet to be assigned a parent."" [GR:pj]",,PTO,Plant Trait Ontology,https://bioportal.bioontology.org/ontologies/PTO,EO:0007064,ecological environment,"""A plant treatment (EO:0001001) involving exposure to the various factors that comprise a geographical/regional location."" [GR:pj, PO:cooperl]",,PECO,Plant Environmental Conditions,https://bioportal.bioontology.org/ontologies/PECO,UO:0000005,temperature unit,"""A unit which is a standard measure of the average kinetic energy of the particles in a sample of matter."" [Wikipedia:Wikipedia]",,UO,Units of Measurement,https://bioportal.bioontology.org/ontologies/UO,1
Arabidopsis thaliana (NCBI: 3702),1894,Trichome solidity,10.21958/phenotype:1894,trichome_development_epidermis_metal_traits,Trichome solidity (abbreviated as solidity in the article) determined using built-in functions of Fiji ;from binary images generated by thresholding polarized light photos using the Yen method as implemented in Fiji software; average from at least 25 interactively selected detached or in situ trichomes from 3 leaves of 3 plants.,,1,Arabidopsis seeds were sterilized with chlorine gas; stratified in tubes at 4 deg. C for three days in the dark and sown into standard soil substrate pre-treated with Confidor to prevent black flies infestation. Plants were grown under controlled long-day conditions (16 hr light; 23 oC/8 hr darkness; 18 oC; relative air humidity 60 %). Three seedlings per genotype were planted into individual pots at the first true leaf stage. Three approximately fingernail-sized mature; non-senescent rosette leaves per plant were collected at the age of 5 weeks (at which point plants of some but not all of the genotypes were beginning to bolt).,2023-05-17T13:48:29.002084Z,0,TO:0000911,trichome morphology trait,"""A plant structure morphology trait (TO:0000839) which is a quality of a trichome (PO:0000282)."" [PO:0000282, TO:moorel]",,PTO,Plant Trait Ontology,https://bioportal.bioontology.org/ontologies/PTO,EO:0007269,growth chamber study,"""The treatment involving study type in which plants were grown in growth chambers."" [GR:pj]",,PECO,Plant Environmental Conditions,https://bioportal.bioontology.org/ontologies/PECO,UO:0000186,dimensionless unit,"""A unit which is a standard measure of physical quantity consisting of only a numerical number without any units."" [Wikipedia:Wikipedia]",,UO,Units of Measurement,https://bioportal.bioontology.org/ontologies/UO,1